Target
Neuromedin-K receptor
Ligand
BDBM50001447
Substrate
Meas. Tech.
ChEBML_209701
EC50
563±n/a nM
Citation
 Deal, MJHagan, RMIreland, SJJordan, CCMcElroy, ABPorter, BRoss, BCStephens-Smith, MWard, P Conformationally constrained tachykinin analogues: potent and highly selective neurokinin NK-2 receptor agonists. J Med Chem 35:4195-204 (1992)  
Target
Name:
Neuromedin-K receptor
Synonyms:
NK3R_RAT Tac3r | Tacr3
Type:
Mol. Mass.:
51128.60
Organism:
Rattus norvegicus
Description:
ChEMBL_10983
Residue:
452
  
Inhibitor
Name:
BDBM50001447
Synonyms:
CHEMBL217406 His-Lys-Thr-Asp-Ser-Phe-Val-Gly-Leu-Met-NH2(NeurokininA)
Type:
Small organic molecule
Emp. Form.:
C50H80N14O14S
Mol. Mass.:
1133.321
SMILES:
CSCC[C@H](NC(=O)[C@H](CC(C)C)NC(=O)CNC(=O)[C@@H](NC(=O)[C@H](Cc1ccccc1)NC(=O)[C@H](CO)NC(=O)[C@H](CC(O)=O)NC(=O)[C@@H](NC(=O)[C@H](CCCCN)NC(=O)[C@@H](N)Cc1cnc[nH]1)[C@@H](C)O)C(C)C)C(N)=O
: