Target
5-hydroxytryptamine receptor 2A/2B/2C
Ligand
BDBM50002250
Substrate
Meas. Tech.
ChEBML_2126
Ki
6±n/a nM
Citation
 Gilligan, PJCain, GAChristos, TECook, LDrummond, SJohnson, ALKergaye, AAMcElroy, JFRohrbach, KWSchmidt, WK Novel piperidine sigma receptor ligands as potential antipsychotic drugs. J Med Chem 35:4344-61 (1992)  
Target
Name:
5-hydroxytryptamine receptor 2A/2B/2C
Synonyms:
Serotonin 2 (5-HT2) receptor
Type:
Mol. Mass.:
Description:
ASSAY_ID of ChEMBL is 2124
Components:
This complex has 3 components.
Component 1
Name:
5-hydroxytryptamine receptor 2C
Synonyms:
5-HT2C 5-hydroxytryptamine receptor 2C (5HT2C) 5ht1c Htr1c Serotonin 2c (5-HT2c) receptor
Type:
Enzyme
Mol. Mass.:
51948.16
Organism:
Mus musculus (Mouse)
Description:
P34968
Residue:
459
  
Component 2
Name:
5-hydroxytryptamine receptor 2A
Synonyms:
5-HT-2 5-hydroxytryptamine receptor 2A 5HT2A_MOUSE Htr2 Serotonin 2a (5-HT2a) receptor
Type:
Enzyme
Mol. Mass.:
52843.00
Organism:
Mus musculus (Mouse)
Description:
P35363
Residue:
471
  
Component 3
Name:
5-hydroxytryptamine receptor 2B
Synonyms:
5-HT2 5-hydroxytryptamine receptor 2B 5HT2B_MOUSE Htr2b
Type:
Enzyme
Mol. Mass.:
53610.91
Organism:
Mus musculus (Mouse)
Description:
Q02152
Residue:
479
  
Inhibitor
Name:
BDBM50002250
Synonyms:
1-(4-Fluoro-phenyl)-2-[1-(4-trifluoromethyl-benzyl)-piperidin-4-yl]-ethanone | CHEMBL138281
Type:
Small organic molecule
Emp. Form.:
C21H21F4NO
Mol. Mass.:
379.3912
SMILES:
Fc1ccc(cc1)C(=O)CC1CCN(Cc2ccc(cc2)C(F)(F)F)CC1
: