Target
Sigma non-opioid intracellular receptor 1
Ligand
BDBM50002200
Substrate
Meas. Tech.
ChEBML_201877
Ki
5±n/a nM
Citation
 Gilligan, PJCain, GAChristos, TECook, LDrummond, SJohnson, ALKergaye, AAMcElroy, JFRohrbach, KWSchmidt, WK Novel piperidine sigma receptor ligands as potential antipsychotic drugs. J Med Chem 35:4344-61 (1992)  
Target
Name:
Sigma non-opioid intracellular receptor 1
Synonyms:
Opioid receptor, sigma 1 SGMR1_MOUSE Sigma1-receptor Sigmar1
Type:
Enzyme Catalytic Domain
Mol. Mass.:
25246.51
Organism:
Mus musculus (Mouse)
Description:
O55242
Residue:
223
  
Inhibitor
Name:
BDBM50002200
Synonyms:
4-(4-Fluoro-phenoxymethyl)-1-(2-methyl-cyclopropylmethyl)-piperidine; compound with but-2-enedioic acid | CHEMBL137085
Type:
Small organic molecule
Emp. Form.:
C17H24FNO
Mol. Mass.:
277.377
SMILES:
CC1CC1CN1CCC(COc2ccc(F)cc2)CC1
: