Target
Sigma non-opioid intracellular receptor 1
Ligand
BDBM50002225
Substrate
Meas. Tech.
ChEBML_201877
Ki
4.5±n/a nM
Citation
 Gilligan, PJCain, GAChristos, TECook, LDrummond, SJohnson, ALKergaye, AAMcElroy, JFRohrbach, KWSchmidt, WK Novel piperidine sigma receptor ligands as potential antipsychotic drugs. J Med Chem 35:4344-61 (1992)  
Target
Name:
Sigma non-opioid intracellular receptor 1
Synonyms:
Opioid receptor, sigma 1 SGMR1_MOUSE Sigma1-receptor Sigmar1
Type:
Enzyme Catalytic Domain
Mol. Mass.:
25246.51
Organism:
Mus musculus (Mouse)
Description:
O55242
Residue:
223
  
Inhibitor
Name:
BDBM50002225
Synonyms:
1-Benzyl-4-[2-(4-tert-butyl-benzyloxy)-ethyl]-piperidine; hydrochloride | CHEMBL539553
Type:
Small organic molecule
Emp. Form.:
C25H35NO
Mol. Mass.:
365.5515
SMILES:
CC(C)(C)c1ccc(COCCC2CCN(Cc3ccccc3)CC2)cc1
: