Target
D(2) dopamine receptor
Ligand
BDBM50002313
Substrate
Meas. Tech.
ChEBML_61607
IC50
730±n/a nM
Citation
 Claudi, FGiorgioni, GDi Stefano, AAbbracchio, MPPaoletti, AMBalduini, W Synthesis and pharmacological characterization of 2-(4-chloro-3-hydroxyphenyl)ethylamine and N,N-dialkyl derivatives as dopamine receptor ligands. J Med Chem 35:4408-14 (1992)  
Target
Name:
D(2) dopamine receptor
Synonyms:
DOPAMINE D2 DOPAMINE D2 Short Dopamine D2 receptor Drd2
Type:
G Protein-Coupled Receptor (GPCR)
Mol. Mass.:
50931.60
Organism:
Rattus norvegicus (rat)
Description:
P61169
Residue:
444
  
Inhibitor
Name:
BDBM50002313
Synonyms:
2-Chloro-5-(2-{[2-(3-hydroxy-phenyl)-ethyl]-propyl-amino}-ethyl)-phenol; hydrobromide | CHEMBL541096
Type:
Small organic molecule
Emp. Form.:
C19H24ClNO2
Mol. Mass.:
333.852
SMILES:
CCCN(CCc1cccc(O)c1)CCc1ccc(Cl)c(O)c1
: