Target
Adenosine receptor A1
Ligand
BDBM50368479
Substrate
Meas. Tech.
ChEMBL_29279 (CHEMBL640340)
EC50
4.169E4±n/a nM
Citation
 Niiya, KThompson, RDSilvia, SKOlsson, RA 2-(N'-aralkylidenehydrazino)adenosines: potent and selective coronary vasodilators. J Med Chem 35:4562-6 (1993)  
Target
Name:
Adenosine receptor A1
Synonyms:
A1 adenosine receptor ADENOSINE A1 ADENOSINE A1 low Adenosine A1 receptor | Adenosine Receptor A1
Type:
Enzyme Catalytic Domain
Mol. Mass.:
36501.39
Organism:
GUINEA PIG
Description:
ADENOSINE A1 ADORA1 GUINEA PIG::P47745
Residue:
326
  
Inhibitor
Name:
BDBM50368479
Synonyms:
CHEMBL611918
Type:
Small organic molecule
Emp. Form.:
C16H18N8O4
Mol. Mass.:
386.3653
SMILES:
Nc1nc(N=NCc2ccccn2)nc2n(cnc12)C1O[C@H](CO)[C@@H](O)[C@H]1O
: