Target
Sigma non-opioid intracellular receptor 1
Ligand
BDBM50004107
Substrate
Meas. Tech.
ChEMBL_226550 (CHEMBL846627)
IC50
1100±n/a nM
Citation
 Kimes, ASWilson, AAScheffel, UCampbell, BGLondon, ED Radiosynthesis, cerebral distribution, and binding of [125I]-1-(p-iodophenyl)-3-(1-adamantyl)guanidine, a ligand for sigma binding sites. J Med Chem 35:4683-9 (1993)  
Target
Name:
Sigma non-opioid intracellular receptor 1
Synonyms:
Aging-associated gene 8 protein SGMR1_HUMAN SIGMAR1 SR31747-binding protein Sigma 1-type opioid receptor Sigma1R | hSigmaR1
Type:
Enzyme Catalytic Domain
Mol. Mass.:
25124.85
Organism:
Homo sapiens (Human)
Description:
Q99720
Residue:
223
  
Inhibitor
Name:
BDBM50004107
Synonyms:
1-(1-Thiophen-2-yl-cyclohexyl)-piperidine Tenocyclidine
Type:
Small organic molecule
Emp. Form.:
C15H23NS
Mol. Mass.:
249.415
SMILES:
C1CCN(CC1)C1(CCCCC1)c1cccs1
: