Target
Sodium-dependent dopamine transporter
Ligand
BDBM22418
Substrate
Meas. Tech.
ChEMBL_59437 (CHEMBL671450)
IC50
580±n/a nM
Citation
 Kozikowski, APRoberti, MXiang, LBergmann, JSCallahan, PMCunningham, KAJohnson, KM Structure-activity relationship studies of cocaine: replacement of the C-2 ester group by vinyl argues against H-bonding and provides an esterase-resistant, high-affinity cocaine analogue. J Med Chem 35:4764-6 (1993)  
Target
Name:
Sodium-dependent dopamine transporter
Synonyms:
DA transporter SC6A3_RAT Sodium-dependent dopamine transporter | Sodium-dependent dopamine transporter (DAT)
Type:
Multi-pass membrane protein
Mol. Mass.:
68749.45
Organism:
Rattus norvegicus (rat)
Description:
P23977
Residue:
619
  
Inhibitor
Name:
BDBM22418
Synonyms:
Cocaine methyl (1R,2R,3S,5S)-3-(benzoyloxy)-8-methyl-8-azabicyclo[3.2.1]octane-2-carboxylate | methyl (1R,2R,3S,5S)-8-methyl-3-[(phenylcarbonyl)oxy]-8-azabicyclo[3.2.1]octane-2-carboxylate
Type:
Emp. Form.:
C17H21NO4
Mol. Mass.:
303.3529
SMILES:
[H][C@]12CC[C@]([H])([C@H]([C@H](C1)OC(=O)c1ccccc1)C(=O)OC)N2C
: