Target
Adenosine receptor A1
Ligand
BDBM50452575
Substrate
Meas. Tech.
ChEBML_29305
Ki
0.300000±n/a nM
Citation
 Jacobson, KAvan Galen, PJWilliams, M Adenosine receptors: pharmacology, structure-activity relationships, and therapeutic potential. J Med Chem 35:407-22 (1992)  
Target
Name:
Adenosine receptor A1
Synonyms:
AA1R_RAT ADENOSINE A1 high Adenosine A1 receptor (A1) Adenosine receptors A1 | Adora1
Type:
Protein
Mol. Mass.:
36704.13
Organism:
Rattus norvegicus (rat)
Description:
Residue:
326
  
Inhibitor
Name:
BDBM50452575
Synonyms:
CHEMBL2112182
Type:
Small organic molecule
Emp. Form.:
C17H23N5O4
Mol. Mass.:
361.3956
SMILES:
[H][C@]12CCC(C1)[C@]([H])(C2)Nc1ncnc2n(cnc12)[C@@H]1O[C@H](CO)[C@@H](O)[C@H]1O
: