Target
5-hydroxytryptamine receptor 1B
Ligand
BDBM50001875
Substrate
Meas. Tech.
ChEBML_1808
Ki
95±n/a nM
Citation
 Scott, MKMartin, GEDiStefano, DLFedde, CLKukla, MJBarrett, DLBaldy, WJElgin, RJKesslick, JMMathiasen, JR Pyrrole mannich bases as potential antipsychotic agents. J Med Chem 35:552-8 (1992)  
Target
Name:
5-hydroxytryptamine receptor 1B
Synonyms:
5-HT-1B 5-hydroxytryptamine receptor 1B (5HT1B) 5ht1b Serotonin 1 (5-HT1) receptor Serotonin receptor 1B
Type:
Protein
Mol. Mass.:
43173.33
Organism:
Rattus norvegicus (Rat)
Description:
P28564
Residue:
386
  
Inhibitor
Name:
BDBM50001875
Synonyms:
1-{5-[4-(3-Chloro-phenyl)-piperazin-1-ylmethyl]-1-methyl-1H-pyrrol-2-ylmethyl}-piperidin-2-one | CHEMBL153451
Type:
Small organic molecule
Emp. Form.:
C22H29ClN4O
Mol. Mass.:
400.945
SMILES:
Cn1c(CN2CCN(CC2)c2cccc(Cl)c2)ccc1CN1CCCCC1=O
: