Target
Neutrophil elastase
Ligand
BDBM50005160
Substrate
Meas. Tech.
ChEBML_63659
IC50
>5000±n/a nM
Citation
 Skiles, JWFuchs, VMiao, CSorcek, RGrozinger, KGMauldin, SCVitous, JMui, PWJacober, SChow, G Inhibition of human leukocyte elastase (HLE) by N-substituted peptidyl trifluoromethyl ketones. J Med Chem 35:641-62 (1992)  
Target
Name:
Neutrophil elastase
Synonyms:
Bone marrow serine protease Coagulation factor X ELANE Elastase HLE Leukocyte elastase Medullasin Neutrophil elastase (HNE) PMN elastase Trypsin
Type:
Enzyme
Mol. Mass.:
28532.38
Organism:
Homo sapiens (Human)
Description:
P08246
Residue:
267
  
Inhibitor
Name:
BDBM50005160
Synonyms:
CHEMBL348882 | Indan-2-yl-[(3,3,3-trifluoro-1-isopropyl-2-oxo-propylcarbamoyl)-methyl]-carbamic acid benzyl ester
Type:
Small organic molecule
Emp. Form.:
C25H27F3N2O4
Mol. Mass.:
476.4881
SMILES:
CC(C)C(NC(=O)CN(C1Cc2ccccc2C1)C(=O)OCc1ccccc1)C(=O)C(F)(F)F
: