Target
Transmembrane prolyl 4-hydroxylase
Ligand
BDBM50000414
Substrate
Meas. Tech.
ChEBML_157456
IC50
9600±n/a nM
Citation
 Dowell, RIHadley, EM Novel inhibitors of prolyl 4-hydroxylase. J Med Chem 35:800-4 (1992)  
Target
Name:
Transmembrane prolyl 4-hydroxylase
Synonyms:
Hypoxia-inducible factor prolyl 4-hydroxylase Hypoxia-inducible factor prolyl hydroxylase 4 P4HTM PH4 | Transmembrane prolyl 4-hydroxylase
Type:
Enzyme
Mol. Mass.:
56654.25
Organism:
Homo sapiens (Human)
Description:
Q9NXG6
Residue:
502
  
Inhibitor
Name:
BDBM50000414
Synonyms:
5-Carboxymethyl-pyridine-2-carboxylic acid | CHEMBL168009
Type:
Small organic molecule
Emp. Form.:
C8H7NO4
Mol. Mass.:
181.1455
SMILES:
OC(=O)Cc1ccc(nc1)C(O)=O
: