Target
Aminopeptidase B
Ligand
BDBM50001946
Substrate
Meas. Tech.
ChEMBL_35342 (CHEMBL646060)
IC50
>1000000±n/a nM
Citation
 Herranz, RVinuesa, SPérez, CGarcía-López, MTLópez, Ede Ceballos, MLDel Río, J Analgesic dipeptide derivatives. 7. 3,7-Diamino-2-hydroxyheptanoic acid (DAHHA) containing dipeptide analogues of the analgesic compound H-Lys-Trp(Nps)-OMe. J Med Chem 35:889-95 (1992)  
Target
Name:
Aminopeptidase B
Synonyms:
AMPB_RAT Arginine aminopeptidase Cytosol aminopeptidase IV | Rnpep
Type:
PROTEIN
Mol. Mass.:
72609.93
Organism:
Rattus norvegicus
Description:
ChEMBL_1344423
Residue:
650
  
Inhibitor
Name:
BDBM50001946
Synonyms:
2-(6-Amino-2-aminomethyl-hexanoylamino)-3-(1H-indol-3-yl)-propionic acid Lys-Trp
Type:
Small organic molecule
Emp. Form.:
C17H24N4O3
Mol. Mass.:
332.3975
SMILES:
NCCCC[C@H](N)C(=O)N[C@@H](Cc1c[nH]c2ccccc12)C(O)=O
: