Target
D(2) dopamine receptor
Ligand
BDBM50368583
Substrate
Meas. Tech.
ChEMBL_62419 (CHEMBL674823)
Ki
210±n/a nM
Citation
 Moon, MWMorris, JKHeier, RFChidester, CGHoffmann, WEPiercey, MFAlthaus, JSVon Voigtlander, PFEvans, DLFigur, LM Dopaminergic and serotonergic activities of imidazoquinolinones and related compounds. J Med Chem 35:1076-92 (1992)  
Target
Name:
D(2) dopamine receptor
Synonyms:
DOPAMINE D2 DOPAMINE D2 Short Dopamine D2 receptor Drd2
Type:
G Protein-Coupled Receptor (GPCR)
Mol. Mass.:
50931.60
Organism:
Rattus norvegicus (rat)
Description:
P61169
Residue:
444
  
Inhibitor
Name:
BDBM50368583
Synonyms:
CHEMBL1794999
Type:
Small organic molecule
Emp. Form.:
C17H24N2
Mol. Mass.:
256.3859
SMILES:
CCCN(CCC)C1Cc2cccc3ccn(C1)c23
: