Target
5-hydroxytryptamine receptor 1A
Ligand
BDBM50001977
Substrate
Meas. Tech.
ChEBML_575
Ki
17±n/a nM
Citation
 Moon, MWMorris, JKHeier, RFChidester, CGHoffmann, WEPiercey, MFAlthaus, JSVon Voigtlander, PFEvans, DLFigur, LM Dopaminergic and serotonergic activities of imidazoquinolinones and related compounds. J Med Chem 35:1076-92 (1992)  
Target
Name:
5-hydroxytryptamine receptor 1A
Synonyms:
5-HT-1A 5-hydroxytryptamine receptor 1A (5-HT-1A) ADRB2RL1 Dopamine D2 receptor and serotonin 1a receptor HTR1A | Serotonin receptor 1A
Type:
Mol. Mass.:
46122.49
Organism:
Homo sapiens (Human)
Description:
Residue:
422
  
Inhibitor
Name:
BDBM50001977
Synonyms:
6-Dipropylamino-6,7-dihydro-5H-pyrido[3,2,1-ij]quinolin-3-one | CHEMBL269419
Type:
Small organic molecule
Emp. Form.:
C18H24N2O
Mol. Mass.:
284.396
SMILES:
CCCN(CCC)C1Cc2cccc3ccc(=O)n(C1)c23
: