Target
Muscarinic acetylcholine receptor M1
Ligand
BDBM50005501
Substrate
Meas. Tech.
ChEMBL_138559 (CHEMBL745515)
IC50
1100±n/a nM
Citation
 Sowell, JWTang, YValli, MJChapman, JMUsher, LAVaughan, CMKosh, JW Synthesis and cholinergic properties of bis[[(dimethylamino)methyl]furanyl] analogues of ranitidine. J Med Chem 35:1102-8 (1992)  
Target
Name:
Muscarinic acetylcholine receptor M1
Synonyms:
ACM1_MOUSE Cholinergic, muscarinic Chrm1 Muscarinic acetylcholine receptor M1
Type:
Enzyme Catalytic Domain
Mol. Mass.:
51400.50
Organism:
Mus musculus
Description:
Cholinergic, muscarinic 0 0::Q52KQ0
Residue:
460
  
Inhibitor
Name:
BDBM50005501
Synonyms:
CHEMBL275537 | {5-[3-(5-Dimethylaminomethyl-furan-2-ylmethylsulfanyl)-propylsulfanylmethyl]-furan-2-ylmethyl}-dimethyl-amine
Type:
Small organic molecule
Emp. Form.:
C19H30N2O2S2
Mol. Mass.:
382.584
SMILES:
CN(C)Cc1ccc(CSCCCSCc2ccc(CN(C)C)o2)o1
: