Target
Muscarinic acetylcholine receptor M2
Ligand
BDBM50005501
Substrate
Meas. Tech.
ChEMBL_139893 (CHEMBL744480)
IC50
1500±n/a nM
Citation
 Sowell, JWTang, YValli, MJChapman, JMUsher, LAVaughan, CMKosh, JW Synthesis and cholinergic properties of bis[[(dimethylamino)methyl]furanyl] analogues of ranitidine. J Med Chem 35:1102-8 (1992)  
Target
Name:
Muscarinic acetylcholine receptor M2
Synonyms:
ACM2_MOUSE Chrm2 | Muscarinic acetylcholine receptor
Type:
PROTEIN
Mol. Mass.:
51515.43
Organism:
Mus musculus
Description:
ChEMBL_139897
Residue:
466
  
Inhibitor
Name:
BDBM50005501
Synonyms:
CHEMBL275537 | {5-[3-(5-Dimethylaminomethyl-furan-2-ylmethylsulfanyl)-propylsulfanylmethyl]-furan-2-ylmethyl}-dimethyl-amine
Type:
Small organic molecule
Emp. Form.:
C19H30N2O2S2
Mol. Mass.:
382.584
SMILES:
CN(C)Cc1ccc(CSCCCSCc2ccc(CN(C)C)o2)o1
: