Target
5-hydroxytryptamine receptor 3A/3B
Ligand
BDBM50005842
Substrate
Meas. Tech.
ChEMBL_3004 (CHEMBL619794)
Ki
>200±n/a nM
Citation
 Flynn, DLZabrowski, DLBecker, DPNosal, RVillamil, CIGullikson, GWMoummi, CYang, DC SC-53116: the first selective agonist at the newly identified serotonin 5-HT4 receptor subtype. J Med Chem 35:1486-9 (1992)  
Target
Name:
5-hydroxytryptamine receptor 3A/3B
Synonyms:
Serotonin 3 (5-HT3) receptor | Serotonin 3a (5-HT3a)/3b (5-HT3b) receptor
Type:
Mol. Mass.:
Description:
ASSAY_ID of EBI is 2974
Components:
This complex has 2 components.
Component 1
Name:
5-hydroxytryptamine receptor 3B
Synonyms:
5HT3B_RAT Serotonin (5-HT) receptor
Type:
PROTEIN
Mol. Mass.:
50328.78
Organism:
Rattus norvegicus
Description:
EBI_11885
Residue:
437
  
Component 2
Name:
5-hydroxytryptamine receptor 3A
Synonyms:
5-HT3 5HT3A_RAT Htr3 Serotonin (5-HT) receptor | Zacopride site-R
Type:
Enzyme Catalytic Domain
Mol. Mass.:
55428.70
Organism:
RAT
Description:
5-HT3 HTR3A RAT::P35563
Residue:
483
  
Inhibitor
Name:
BDBM50005842
Synonyms:
(exo) N-(Hexahydro-pyrrolizin-1-yl)-benzamide | CHEMBL287237
Type:
Small organic molecule
Emp. Form.:
C14H18N2O
Mol. Mass.:
230.3055
SMILES:
O=C(NC1CCN2CCCC12)c1ccccc1
: