Target
D(1A) dopamine receptor
Ligand
BDBM50368604
Substrate
Meas. Tech.
ChEBML_58795
Ki
>10000±n/a nM
Citation
 Flynn, DLZabrowski, DLBecker, DPNosal, RVillamil, CIGullikson, GWMoummi, CYang, DC SC-53116: the first selective agonist at the newly identified serotonin 5-HT4 receptor subtype. J Med Chem 35:1486-9 (1992)  
Target
Name:
D(1A) dopamine receptor
Synonyms:
DOPAMINE D1 Dopamine D1 high Dopamine receptor Dopamine1-like Drd1a
Type:
Enzyme Catalytic Domain
Mol. Mass.:
49429.75
Organism:
RAT
Description:
P18901
Residue:
446
  
Inhibitor
Name:
BDBM50368604
Synonyms:
CHEMBL1907770
Type:
Small organic molecule
Emp. Form.:
C15H18ClN3O2
Mol. Mass.:
307.775
SMILES:
[H]C12CN3C[C@]1(NC(=O)c1cc(Cl)c(N)cc1OC)C2CC3
: