Target
Delta-type opioid receptor
Ligand
BDBM50000659
Substrate
Meas. Tech.
ChEMBL_147166 (CHEMBL753856)
Ki
1.1±n/a nM
Citation
 Heyl, DLMosberg, HI Substitution on the Phe3 aromatic ring in cyclic delta opioid receptor-selective dermorphin/deltorphin tetrapeptide analogues: electronic and lipophilic requirements for receptor affinity. J Med Chem 35:1535-41 (1992)  
Target
Name:
Delta-type opioid receptor
Synonyms:
D-OR-1 Delta opioid receptor OPIATE Delta OPRD1 OPRK1 | opioid receptor, delta 1
Type:
G Protein-Coupled Receptor (GPCR)
Mol. Mass.:
40382.98
Organism:
Homo sapiens (Human)
Description:
Competition binding assays were carried out using membrane preparations from transfected HN9.10 cells that constitutively expressed the delta opioid receptor.
Residue:
372
  
Inhibitor
Name:
BDBM50000659
Synonyms:
10-[2-Amino-3-(4-hydroxy-phenyl)-propionylamino]-7-(4-fluoro-benzyl)-3,3-dimethyl-6,9-dioxo-1,2-dithia-5,8-diaza-cycloundecane-4-carboxylic acid | CHEMBL290005
Type:
Small organic molecule
Emp. Form.:
C26H31FN4O6S2
Mol. Mass.:
578.676
SMILES:
CC1(C)SSC[C@H](NC(=O)[C@@H](N)Cc2ccc(O)cc2)C(=O)N[C@@H](Cc2ccc(F)cc2)C(=O)N[C@@H]1C(O)=O
: