Target
Mu-type opioid receptor
Ligand
BDBM50000654
Substrate
Meas. Tech.
ChEMBL_146265 (CHEMBL757489)
Ki
10000±n/a nM
Citation
 Heyl, DLMosberg, HI Substitution on the Phe3 aromatic ring in cyclic delta opioid receptor-selective dermorphin/deltorphin tetrapeptide analogues: electronic and lipophilic requirements for receptor affinity. J Med Chem 35:1535-41 (1992)  
Target
Name:
Mu-type opioid receptor
Synonyms:
M-OR-1 Mu opioid receptor OPIATE Mu OPRM_CAVPO
Type:
Enzyme Catalytic Domain
Mol. Mass.:
11165.58
Organism:
GUINEA PIG
Description:
P97266
Residue:
98
  
Inhibitor
Name:
BDBM50000654
Synonyms:
10-[2-Amino-3-(4-hydroxy-phenyl)-propionylamino]-7-(4-tert-butyl-benzyl)-3,3-dimethyl-6,9-dioxo-1,2-dithia-5,8-diaza-cycloundecane-4-carboxylic acid | CHEMBL290968
Type:
Small organic molecule
Emp. Form.:
C30H40N4O6S2
Mol. Mass.:
616.792
SMILES:
CC(C)(C)c1ccc(C[C@@H]2NC(=O)[C@H](CSSC(C)(C)[C@H](NC2=O)C(O)=O)NC(=O)[C@@H](N)Cc2ccc(O)cc2)cc1
: