Target
Kappa-type opioid receptor
Ligand
BDBM50000658
Substrate
Meas. Tech.
ChEBML_145230
Ki
>10000±n/a nM
Citation
 Heyl, DLMosberg, HI Substitution on the Phe3 aromatic ring in cyclic delta opioid receptor-selective dermorphin/deltorphin tetrapeptide analogues: electronic and lipophilic requirements for receptor affinity. J Med Chem 35:1535-41 (1992)  
Target
Name:
Kappa-type opioid receptor
Synonyms:
Kappa Opioid Receptor OPRK1 Opiate Kappa 1 | mu/kappa opioid receptor
Type:
G Protein-Coupled Receptor (GPCR)
Mol. Mass.:
42744.99
Organism:
Cavia porcellus (domestic guinea pig)
Description:
P41144
Residue:
380
  
Inhibitor
Name:
BDBM50000658
Synonyms:
10-[2-Amino-3-(4-hydroxy-phenyl)-propionylamino]-3,3-dimethyl-7-(4-methyl-benzyl)-6,9-dioxo-1,2-dithia-5,8-diaza-cycloundecane-4-carboxylic acid | CHEMBL39562
Type:
Small organic molecule
Emp. Form.:
C27H34N4O6S2
Mol. Mass.:
574.712
SMILES:
Cc1ccc(C[C@@H]2NC(=O)[C@H](CSSC(C)(C)[C@H](NC2=O)C(O)=O)NC(=O)[C@@H](N)Cc2ccc(O)cc2)cc1
: