Target
Neutrophil elastase
Ligand
BDBM50005887
Substrate
Meas. Tech.
ChEMBL_96626 (CHEMBL705699)
IC50
2500±n/a nM
Citation
 Zembower, DEKam, CMPowers, JCZalkow, LH Novel anthraquinone inhibitors of human leukocyte elastase and cathepsin G. J Med Chem 35:1597-605 (1992)  
Target
Name:
Neutrophil elastase
Synonyms:
Bone marrow serine protease Coagulation factor X ELANE Elastase HLE Leukocyte elastase Medullasin Neutrophil elastase (HNE) PMN elastase Trypsin
Type:
Enzyme
Mol. Mass.:
28532.38
Organism:
Homo sapiens (Human)
Description:
P08246
Residue:
267
  
Inhibitor
Name:
BDBM50005887
Synonyms:
CHEMBL440290 | Carbonic acid 8-butoxycarbonyloxy-6-methoxy-3-methyl-9,10-dioxo-9,10-dihydro-anthracen-1-yl ester butyl ester
Type:
Small organic molecule
Emp. Form.:
C26H28O9
Mol. Mass.:
484.4951
SMILES:
CCCCOC(=O)Oc1cc(C)cc2C(=O)c3cc(OC)cc(OC(=O)OCCCC)c3C(=O)c12
: