Target
Neutrophil elastase
Ligand
BDBM50005897
Substrate
Meas. Tech.
ChEMBL_96626 (CHEMBL705699)
IC50
1800±n/a nM
Citation
 Zembower, DEKam, CMPowers, JCZalkow, LH Novel anthraquinone inhibitors of human leukocyte elastase and cathepsin G. J Med Chem 35:1597-605 (1992)  
Target
Name:
Neutrophil elastase
Synonyms:
Bone marrow serine protease Coagulation factor X ELANE Elastase HLE Leukocyte elastase Medullasin Neutrophil elastase (HNE) PMN elastase Trypsin
Type:
Enzyme
Mol. Mass.:
28532.38
Organism:
Homo sapiens (Human)
Description:
P08246
Residue:
267
  
Inhibitor
Name:
BDBM50005897
Synonyms:
CHEMBL40840 | Carbonic acid 8-butoxycarbonyloxy-3-methyl-9,10-dioxo-6-propoxy-9,10-dihydro-anthracen-1-yl ester butyl ester
Type:
Small organic molecule
Emp. Form.:
C28H32O9
Mol. Mass.:
512.5483
SMILES:
CCCCOC(=O)Oc1cc(C)cc2C(=O)c3cc(OCCC)cc(OC(=O)OCCCC)c3C(=O)c12
: