Target
Cathepsin G
Ligand
BDBM50005882
Substrate
Meas. Tech.
ChEBML_45341
IC50
25000±n/a nM
Citation
 Zembower, DEKam, CMPowers, JCZalkow, LH Novel anthraquinone inhibitors of human leukocyte elastase and cathepsin G. J Med Chem 35:1597-605 (1992)  
Target
Name:
Cathepsin G
Synonyms:
CATG_HUMAN CTSG
Type:
PROTEIN
Mol. Mass.:
28860.08
Organism:
Homo sapiens (Human)
Description:
ChEMBL_1469016
Residue:
255
  
Inhibitor
Name:
BDBM50005882
Synonyms:
1,8-Dihydroxy-2-propyl-anthraquinone | CHEMBL40292
Type:
Small organic molecule
Emp. Form.:
C17H14O4
Mol. Mass.:
282.2907
SMILES:
CCCc1ccc2C(=O)c3cccc(O)c3C(=O)c2c1O
: