Target
Cathepsin G
Ligand
BDBM50005884
Substrate
Meas. Tech.
ChEBML_45341
IC50
28000±n/a nM
Citation
 Zembower, DEKam, CMPowers, JCZalkow, LH Novel anthraquinone inhibitors of human leukocyte elastase and cathepsin G. J Med Chem 35:1597-605 (1992)  
Target
Name:
Cathepsin G
Synonyms:
CATG_HUMAN CTSG
Type:
PROTEIN
Mol. Mass.:
28860.08
Organism:
Homo sapiens (Human)
Description:
ChEMBL_1469016
Residue:
255
  
Inhibitor
Name:
BDBM50005884
Synonyms:
2-Hexyl-1,8-dihydroxy-anthraquinone | CHEMBL41317
Type:
Small organic molecule
Emp. Form.:
C20H20O4
Mol. Mass.:
324.3704
SMILES:
CCCCCCc1ccc2C(=O)c3cccc(O)c3C(=O)c2c1O
: