Target
Neutrophil elastase
Ligand
BDBM50005915
Substrate
Meas. Tech.
ChEBML_63648
IC50
6700±n/a nM
Citation
 Zembower, DEKam, CMPowers, JCZalkow, LH Novel anthraquinone inhibitors of human leukocyte elastase and cathepsin G. J Med Chem 35:1597-605 (1992)  
Target
Name:
Neutrophil elastase
Synonyms:
Bone marrow serine protease Coagulation factor X ELANE Elastase HLE Leukocyte elastase Medullasin Neutrophil elastase (HNE) PMN elastase Trypsin
Type:
Enzyme
Mol. Mass.:
28532.38
Organism:
Homo sapiens (Human)
Description:
P08246
Residue:
267
  
Inhibitor
Name:
BDBM50005915
Synonyms:
2-Benzyl-1-hydroxy-8-methoxy-anthraquinone | CHEMBL290774
Type:
Small organic molecule
Emp. Form.:
C22H16O4
Mol. Mass.:
344.36
SMILES:
COc1cccc2C(=O)c3ccc(Cc4ccccc4)c(O)c3C(=O)c12
: