Target
Acyl-CoA:cholesterol acyltransferase
Ligand
BDBM50005940
Substrate
Meas. Tech.
ChEBML_28339
IC50
200±n/a nM
Citation
 Roth, BDBlankley, CJHoefle, MLHolmes, ARoark, WHTrivedi, BKEssenburg, ADKieft, KAKrause, BRStanfield, RL Inhibitors of acyl-CoA:cholesterol acyltransferase. 1. Identification and structure-activity relationships of a novel series of fatty acid anilide hypocholesterolemic agents. J Med Chem 35:1609-17 (1992)  
Target
Name:
Acyl-CoA:cholesterol acyltransferase
Synonyms:
ACAT
Type:
Mol. Mass.:
35405.31
Organism:
Oryctolagus cuniculus
Description:
Residue:
305
  
Inhibitor
Name:
BDBM50005940
Synonyms:
2-Methylene-dodecanoic acid (2,4,6-trimethoxy-phenyl)-amide | CHEMBL44099
Type:
Small organic molecule
Emp. Form.:
C22H35NO4
Mol. Mass.:
377.5176
SMILES:
CCCCCCCCCCC(=C)C(=O)Nc1c(OC)cc(OC)cc1OC
: