Target
Acyl-CoA:cholesterol acyltransferase
Ligand
BDBM50005965
Substrate
Meas. Tech.
ChEMBL_28338 (CHEMBL646538)
IC50
51±n/a nM
Citation
 Roth, BDBlankley, CJHoefle, MLHolmes, ARoark, WHTrivedi, BKEssenburg, ADKieft, KAKrause, BRStanfield, RL Inhibitors of acyl-CoA:cholesterol acyltransferase. 1. Identification and structure-activity relationships of a novel series of fatty acid anilide hypocholesterolemic agents. J Med Chem 35:1609-17 (1992)  
Target
Name:
Acyl-CoA:cholesterol acyltransferase
Synonyms:
ACAT
Type:
Mol. Mass.:
35405.31
Organism:
Oryctolagus cuniculus
Description:
Residue:
305
  
Inhibitor
Name:
BDBM50005965
Synonyms:
CHEMBL40519 Octadeca-10,13-dienoic acid 4-hydroxy-3-methoxy-benzylamide
Type:
Small organic molecule
Emp. Form.:
C27H45NO4
Mol. Mass.:
447.6505
SMILES:
CCCCCCCC\C=C\CCCCCCCC(=O)Nc1c(OC)cc(OC)cc1OC
: