Target
Acyl-CoA:cholesterol acyltransferase
Ligand
BDBM50005990
Substrate
Meas. Tech.
ChEBML_28339
IC50
350±n/a nM
Citation
 Roth, BDBlankley, CJHoefle, MLHolmes, ARoark, WHTrivedi, BKEssenburg, ADKieft, KAKrause, BRStanfield, RL Inhibitors of acyl-CoA:cholesterol acyltransferase. 1. Identification and structure-activity relationships of a novel series of fatty acid anilide hypocholesterolemic agents. J Med Chem 35:1609-17 (1992)  
Target
Name:
Acyl-CoA:cholesterol acyltransferase
Synonyms:
ACAT
Type:
Mol. Mass.:
35405.31
Organism:
Oryctolagus cuniculus
Description:
Residue:
305
  
Inhibitor
Name:
BDBM50005990
Synonyms:
CHEMBL41085 | Octadec-9-enoic acid (5,6,7,8-tetrahydro-naphthalen-1-yl)-amide
Type:
Small organic molecule
Emp. Form.:
C28H45NO
Mol. Mass.:
411.663
SMILES:
CCCCCCCC\C=C\CCCCCCCC(=O)Nc1cccc2CCCCc12
: