Target
Platelet-activating factor receptor
Ligand
BDBM50006055
Substrate
Meas. Tech.
ChEBML_221704
IC50
570±n/a nM
Citation
 Wissner, ACarroll, MLGreen, KEKerwar, SSPickett, WCSchaub, RETorley, LWWrenn, SKohler, CA Analogues of platelet activating factor. 6. Mono- and bis-aryl phosphate antagonists of platelet activating factor. J Med Chem 35:1650-62 (1992)  
Target
Name:
Platelet-activating factor receptor
Synonyms:
PAF-R PTAFR_CAVPO Platelet-activating factor receptor
Type:
Protein
Mol. Mass.:
39005.63
Organism:
Cavia porcellus
Description:
Residue:
342
  
Inhibitor
Name:
BDBM50006055
Synonyms:
3-{3-[(5-Bromo-2-methoxy-3-tetradecyloxy-phenoxy)-hydroxy-phosphoryloxy]-benzyl}-5-methyl-thiazol-3-ium | CHEMBL44975
Type:
Small organic molecule
Emp. Form.:
C32H45BrNO6PS
Mol. Mass.:
682.646
SMILES:
CCCCCCCCCCCCCCOc1cc(Br)cc(OP([O-])(=O)Oc2cccc(C[n+]3csc(C)c3)c2)c1OC
: