Target
Platelet-activating factor receptor
Ligand
BDBM50006042
Substrate
Meas. Tech.
ChEBML_221704
IC50
4080±n/a nM
Citation
 Wissner, ACarroll, MLGreen, KEKerwar, SSPickett, WCSchaub, RETorley, LWWrenn, SKohler, CA Analogues of platelet activating factor. 6. Mono- and bis-aryl phosphate antagonists of platelet activating factor. J Med Chem 35:1650-62 (1992)  
Target
Name:
Platelet-activating factor receptor
Synonyms:
PAF-R PTAFR_CAVPO Platelet-activating factor receptor
Type:
Protein
Mol. Mass.:
39005.63
Organism:
Cavia porcellus
Description:
Residue:
342
  
Inhibitor
Name:
BDBM50006042
Synonyms:
3-(3-{Hydroxy-[2-methoxy-3-(3-tetradecyloxy-phenoxy)-propoxy]-phosphoryloxy}-benzyl)-5-methyl-thiazol-3-ium | CHEMBL46421
Type:
Small organic molecule
Emp. Form.:
C35H52NO7PS
Mol. Mass.:
661.829
SMILES:
CCCCCCCCCCCCCCOc1cccc(OCC(COP([O-])(=O)Oc2cccc(C[n+]3csc(C)c3)c2)OC)c1
: