Target
Platelet-activating factor receptor
Ligand
BDBM50006082
Substrate
Meas. Tech.
ChEBML_221704
IC50
90±n/a nM
Citation
 Wissner, ACarroll, MLGreen, KEKerwar, SSPickett, WCSchaub, RETorley, LWWrenn, SKohler, CA Analogues of platelet activating factor. 6. Mono- and bis-aryl phosphate antagonists of platelet activating factor. J Med Chem 35:1650-62 (1992)  
Target
Name:
Platelet-activating factor receptor
Synonyms:
PAF-R PTAFR_CAVPO Platelet-activating factor receptor
Type:
Protein
Mol. Mass.:
39005.63
Organism:
Cavia porcellus
Description:
Residue:
342
  
Inhibitor
Name:
BDBM50006082
Synonyms:
3-{3-[(2,5-Di-tert-butyl-4-dodecyloxy-phenoxy)-hydroxy-phosphoryloxy]-benzyl}-5-methyl-thiazol-3-ium | CHEMBL46754
Type:
Small organic molecule
Emp. Form.:
C37H56NO5PS
Mol. Mass.:
657.883
SMILES:
CCCCCCCCCCCCOc1cc(c(OP([O-])(=O)Oc2cccc(C[n+]3csc(C)c3)c2)cc1C(C)(C)C)C(C)(C)C
: