Target
Endothelin-converting enzyme 1
Ligand
BDBM50046135
Substrate
Meas. Tech.
ChEBML_64345
IC50
109000±n/a nM
Citation
 Bertenshaw, SRRogers, RSStern, MKNorman, BHMoore, WMJerome, GMBranson, LMMcDonald, JFMcMahon, EGPalomo, MA Phosphorus-containing inhibitors of endothelin converting enzyme: effects of the electronic nature of phosphorus on inhibitor potency. J Med Chem 36:173-6 (1993)  
Target
Name:
Endothelin-converting enzyme 1
Synonyms:
ECE-1 ECE1_HUMAN Endothelin-converting enzyme 1 (ECE1)
Type:
Enzyme
Mol. Mass.:
87155.11
Organism:
Homo sapiens (Human)
Description:
P42892
Residue:
770
  
Inhibitor
Name:
BDBM50046135
Synonyms:
2-[2-(Ethoxy-hydroxy-phosphorylamino)-4-methyl-pentanoylamino]-3-(1H-indol-3-yl)-propionic acid
Type:
Small organic molecule
Emp. Form.:
C19H27N3O6P
Mol. Mass.:
424.4085
SMILES:
CCOP([O-])(=O)N[C@@H](CC(C)C)C(=O)N[C@@H](Cc1c[nH]c2ccccc12)C(O)=O
: