Target
D(2) dopamine receptor
Ligand
BDBM50034330
Substrate
Meas. Tech.
ChEMBL_59890 (CHEMBL673016)
Ki
77±n/a nM
Citation
 Chidester, CGLin, CHLahti, RAHaadsma-Svensson, SRSmith, MW Comparison of 5-HT1A and dopamine D2 pharmacophores. X-ray structures and affinities of conformationally constrained ligands. J Med Chem 36:1301-15 (1993)  
Target
Name:
D(2) dopamine receptor
Synonyms:
D(2) dopamine receptor DOPAMINE D2 Long DRD2 Dopamine D2 receptor Dopamine D2 receptor (D2R) Dopamine2-like | d2
Type:
Cell-surface receptors
Mol. Mass.:
50647.10
Organism:
Homo sapiens (Human)
Description:
P14416
Residue:
443
  
Inhibitor
Name:
BDBM50034330
Synonyms:
(3aR,9bS) 3-Allyl-9-methoxy-2,3,3a,4,5,9b-hexahydro-1H-benzo[e]indole (3aS,9bR) 3-Allyl-9-methoxy-2,3,3a,4,5,9b-hexahydro-1H-benzo[e]indole CHEMBL26118
Type:
Small organic molecule
Emp. Form.:
C16H21NO
Mol. Mass.:
243.344
SMILES:
COc1cccc2CC[C@@H]3[C@@H](CCN3CC=C)c12
: