Target
D(2) dopamine receptor
Ligand
BDBM50047135
Substrate
Meas. Tech.
ChEBML_59890
Ki
0.800000±n/a nM
Citation
 Chidester, CGLin, CHLahti, RAHaadsma-Svensson, SRSmith, MW Comparison of 5-HT1A and dopamine D2 pharmacophores. X-ray structures and affinities of conformationally constrained ligands. J Med Chem 36:1301-15 (1993)  
Target
Name:
D(2) dopamine receptor
Synonyms:
D(2) dopamine receptor DOPAMINE D2 Long DRD2 Dopamine D2 receptor Dopamine D2 receptor (D2R) Dopamine2-like | d2
Type:
Cell-surface receptors
Mol. Mass.:
50647.10
Organism:
Homo sapiens (Human)
Description:
P14416
Residue:
443
  
Inhibitor
Name:
BDBM50047135
Synonyms:
(Terguride)1,1-Diethyl-3-(7-methyl-4,6,6a,7,8,9,10,10a-octahydro-indeno[7,1-f]quinolin-9-yl)-urea | CHEMBL285341
Type:
Small organic molecule
Emp. Form.:
C21H29N3O
Mol. Mass.:
339.4745
SMILES:
CCN(CC)C(=O)N[C@@H]1C[C@H]2[C@@H](CC3=CCc4cccc2c34)N(C)C1
: