Target
5-hydroxytryptamine receptor 1A
Ligand
BDBM50017543
Substrate
Meas. Tech.
ChEBML_581
Ki
1.8±n/a nM
Citation
 Chidester, CGLin, CHLahti, RAHaadsma-Svensson, SRSmith, MW Comparison of 5-HT1A and dopamine D2 pharmacophores. X-ray structures and affinities of conformationally constrained ligands. J Med Chem 36:1301-15 (1993)  
Target
Name:
5-hydroxytryptamine receptor 1A
Synonyms:
5-HT-1A 5-hydroxytryptamine receptor 1A (5-HT-1A) ADRB2RL1 Dopamine D2 receptor and serotonin 1a receptor HTR1A | Serotonin receptor 1A
Type:
Mol. Mass.:
46122.49
Organism:
Homo sapiens (Human)
Description:
Residue:
422
  
Inhibitor
Name:
BDBM50017543
Synonyms:
(6aR,9R,10aR)-9-Methylsulfanylmethyl-7-propyl-4,6,6a,7,8,9,10,10a-octahydro-indolo[4,3-fg]quinolin-7-ium 5-Bromo-7-methyl-4,6,6a,7,8,9-hexahydro-indolo[4,3-fg]quinoline-9-carboxylic acid (10b-hydroxy-5-isobutyl-2-isopropyl-3,6-dioxo-octahydro-oxazolo[3,2-a]pyrrolo[2,1-c]pyrazin-2-yl)-amide 9-Methylsulfanylmethyl-7-propyl-4,6,6a,7,8,9,10,10a-octahydro-indolo[4,3-fg]quinoline 9-Methylsulfanylmethyl-7-propyl-4,6,6a,7,8,9,10,10a-octahydro-indolo[4,3-fg]quinoline, mesylate (Pergolide) PERGOLIDE [2-(1H-Indol-4-yl)-ethyl]-methyl-amine | cid_47811
Type:
Small organic molecule
Emp. Form.:
C19H26N2S
Mol. Mass.:
314.488
SMILES:
CCCN1C[C@H](CSC)C[C@H]2[C@H]1Cc1c[nH]c3cccc2c13
: