Target
D(3) dopamine receptor
Ligand
BDBM50020222
Substrate
Meas. Tech.
ChEMBL_62775 (CHEMBL673302)
Ki
2.9±n/a nM
Citation
 Foulon, CKung, MPKung, HF Synthesis of (R,S)-2'-trans-7-hydroxy-2-[N-n-propyl-N-(3'-iodo-2'- propenyl)-amino]tetralin (trans-7-OH-PIPAT): a new D3 dopamine receptor ligand. J Med Chem 36:1499-500 (1993)  
Target
Name:
D(3) dopamine receptor
Synonyms:
DOPAMINE D3 Dopamine D3 receptor | Drd3
Type:
Protein
Mol. Mass.:
49540.58
Organism:
Rattus norvegicus (Rat)
Description:
P19020
Residue:
446
  
Inhibitor
Name:
BDBM50020222
Synonyms:
(+/-)-7-(dipropylamino)-5,6,7,8-tetrahydronaphthalen-2-ol (R,S) 7-Dipropylamino-5,6,7,8-tetrahydro-naphthalen-2-ol 7-Dipropylamino-5,6,7,8-tetrahydro-naphthalen-2-ol 7-OH-DPAT 7-OH-DPAT,(-) CHEMBL1255966 | CHEMBL285755
Type:
Small organic molecule
Emp. Form.:
C16H25NO
Mol. Mass.:
247.3758
SMILES:
CCCN(CCC)C1CCc2ccc(O)cc2C1
: