Target
Adenosine receptor A2a/A2b
Ligand
BDBM50044433
Substrate
Meas. Tech.
ChEBML_27917
Ki
>100000±n/a nM
Citation
 Suzuki, FShimada, JShiozaki, SIchikawa, SIshii, ANakamura, JNonaka, HKobayashi, HFuse, E Adenosine A1 antagonists. 3. Structure-activity relationships on amelioration against scopolamine- or N6-((R)-phenylisopropyl)adenosine-induced cognitive disturbance. J Med Chem 36:2508-18 (1993)  
Target
Name:
Adenosine receptor A2a/A2b
Synonyms:
Adenosine A2 receptor
Type:
Mol. Mass.:
Description:
ASSAY_ID of ChEMBL is 329906
Components:
This complex has 2 components.
Component 1
Name:
Adenosine receptor A2b
Synonyms:
AA2BR_HUMAN ADORA2B Adenosine receptors A2b | Adenosine receptors; A2a & A2b
Type:
G Protein-Coupled Receptor (GPCR)
Mol. Mass.:
36341.22
Organism:
Homo sapiens (Human)
Description:
Residue:
332
  
Component 2
Name:
Adenosine receptor A2a
Synonyms:
A2A adenosine receptor (hA2A) ADENOSINE A2 ADORA2 Adenosine A2A receptor (A2AAR)
Type:
G Protein-Coupled Receptor (GPCR)
Mol. Mass.:
44716.46
Organism:
Homo sapiens (Human)
Description:
P29274
Residue:
412
  
Inhibitor
Name:
BDBM50044433
Synonyms:
CHEMBL82222 | N-{4-[2-(8-Cyclopentyl-2,6-dioxo-1-propyl-1,2,6,7-tetrahydro-purin-3-yl)-ethyl]-phenyl}-isobutyramide
Type:
Small organic molecule
Emp. Form.:
C25H33N5O3
Mol. Mass.:
451.5612
SMILES:
CCCn1c(=O)n(CCc2ccc(NC(=O)C(C)C)cc2)c2nc([nH]c2c1=O)C1CCCC1
: