Target
Type-1 angiotensin II receptor A
Ligand
BDBM50003154
Substrate
Meas. Tech.
ChEBML_36154
Ki
0.610000±n/a nM
Citation
 Winn, MDe, BZydowsky, TMAltenbach, RJBasha, FZBoyd, SABrune, MEBuckner, SACrowell, DDrizin, I 2-(Alkylamino)nicotinic acid and analogs. Potent angiotensin II antagonists. J Med Chem 36:2676-88 (1993)  
Target
Name:
Type-1 angiotensin II receptor A
Synonyms:
AGTRA_RAT Agtr1 Angiotensin II AT1 Angiotensin II receptor (AT-1) type-1 Type-1A angiotensin II receptor
Type:
Enzyme Catalytic Domain
Mol. Mass.:
40910.53
Organism:
RAT
Description:
ANGIOTENSIN AT1 AGTR1 RAT::P25095
Residue:
359
  
Inhibitor
Name:
BDBM50003154
Synonyms:
2-{Propyl-[2'-(1H-tetrazol-5-yl)-biphenyl-4-ylmethyl]-amino}-nicotinic acid A-81988 | CHEMBL416477
Type:
Small organic molecule
Emp. Form.:
C23H22N6O2
Mol. Mass.:
414.4598
SMILES:
CCCN(Cc1ccc(cc1)-c1ccccc1-c1nnn[nH]1)c1ncccc1C(O)=O
: