Target
5-hydroxytryptamine receptor 1A
Ligand
BDBM50041951
Substrate
Meas. Tech.
ChEMBL_1138 (CHEMBL616083)
Ki
10±n/a nM
Citation
 Zhuang, ZPKung, MPKung, HF Synthesis of (R,S)-trans-8-hydroxy-2-[N-n-propyl-N-(3'-iodo-2'-propenyl)amino]tetral in (trans-8-OH-PIPAT): a new 5-HT1A receptor ligand. J Med Chem 36:3161-5 (1993)  
Target
Name:
5-hydroxytryptamine receptor 1A
Synonyms:
5-HT-1A 5-HT1A 5-hydroxytryptamine receptor 1A (5HT1A) 5ht1a Htr1a Serotonin 1a (5-HT1a) receptor/Adrenergic receptor alpha-1 | Serotonin receptor 1A
Type:
G Protein-Coupled Receptor (GPCR)
Mol. Mass.:
46445.29
Organism:
Rattus norvegicus (rat)
Description:
Binding assays were performed using rat hippocampal membranes.
Residue:
422
  
Inhibitor
Name:
BDBM50041951
Synonyms:
(R,S) 7-(3-Iodo-allylamino)-5,6,7,8-tetrahydro-naphthalen-1-ol | CHEMBL321905
Type:
Small organic molecule
Emp. Form.:
C13H16INO
Mol. Mass.:
329.1767
SMILES:
Oc1cccc2CCC(Cc12)NC\C=C\I
: