Target
D(2) dopamine receptor
Ligand
BDBM50042341
Substrate
Meas. Tech.
ChEMBL_62226 (CHEMBL670700)
Ki
28±n/a nM
Citation
 Sonesson, CBoije, MSvensson, KEkman, ACarlsson, ARomero, AGMartin, IJDuncan, JNKing, LJWikström, H Orally active central dopamine and serotonin receptor ligands: 5-, 6-, 7-, and 8-[[trifluoromethyl)sulfonyl]oxy]-2-(di-n-propylamino)tetralins and the formation of active metabolites in vivo. J Med Chem 36:3409-16 (1993)  
Target
Name:
D(2) dopamine receptor
Synonyms:
DOPAMINE D2 DOPAMINE D2 Short Dopamine D2 receptor Drd2
Type:
G Protein-Coupled Receptor (GPCR)
Mol. Mass.:
50931.60
Organism:
Rattus norvegicus (rat)
Description:
P61169
Residue:
444
  
Inhibitor
Name:
BDBM50042341
Synonyms:
CHEMBL324750 | Trifluoro-methanesulfonic acid 6-dipropylamino-5,6,7,8-tetrahydro-naphthalen-1-yl ester
Type:
Small organic molecule
Emp. Form.:
C17H24F3NO3S
Mol. Mass.:
379.438
SMILES:
CCCN(CCC)C1CCc2c(C1)cccc2OS(=O)(=O)C(F)(F)F
: