Target
D(2) dopamine receptor
Ligand
BDBM50020221
Substrate
Meas. Tech.
ChEBML_62228
Ki
11±n/a nM
Citation
 Sonesson, CBoije, MSvensson, KEkman, ACarlsson, ARomero, AGMartin, IJDuncan, JNKing, LJWikström, H Orally active central dopamine and serotonin receptor ligands: 5-, 6-, 7-, and 8-[[trifluoromethyl)sulfonyl]oxy]-2-(di-n-propylamino)tetralins and the formation of active metabolites in vivo. J Med Chem 36:3409-16 (1993)  
Target
Name:
D(2) dopamine receptor
Synonyms:
DOPAMINE D2 DOPAMINE D2 Short Dopamine D2 receptor Drd2
Type:
G Protein-Coupled Receptor (GPCR)
Mol. Mass.:
50931.60
Organism:
Rattus norvegicus (rat)
Description:
P61169
Residue:
444
  
Inhibitor
Name:
BDBM50020221
Synonyms:
(-)-5-hydroxy-2-(dipropylamino)tetralin 5-hydroxy-2-(dipropylamino)tetralin 6-Dipropylamino-5,6,7,8-tetrahydro-naphthalen-1-ol (DP-5-ADTN) | CHEMBL273273
Type:
Small organic molecule
Emp. Form.:
C16H25NO
Mol. Mass.:
247.3758
SMILES:
CCCN(CCC)C1CCc2c(O)cccc2C1
: