Target
3-hydroxy-3-methylglutaryl-coenzyme A reductase
Ligand
BDBM50368147
Substrate
Meas. Tech.
ChEMBL_78149 (CHEMBL688066)
IC50
2.5±n/a nM
Citation
 Connolly, PJWestin, CDLoughney, DAMinor, LK HMG-CoA reductase inhibitors: design, synthesis, and biological activity of tetrahydroindazole-substituted 3,5-dihydroxy-6-heptenoic acid sodium salts. J Med Chem 36:3674-85 (1994)  
Target
Name:
3-hydroxy-3-methylglutaryl-coenzyme A reductase
Synonyms:
HMDH_RAT Hmgcr
Type:
Enzyme
Mol. Mass.:
96689.85
Organism:
Rattus norvegicus (rat)
Description:
Isolated rat liver microsomes were used as enzyme source.
Residue:
887
  
Inhibitor
Name:
BDBM50368147
Synonyms:
(+)-(3R,5S)-fluvastatin (3R,5S,6E)-7-[3-(4-fluorophenyl)-1-(propan-2-yl)-1H-indol-2-yl]-3,5-dihydroxyhept-6-enoic acid CHEMBL1078 Fluvastatin | cid_23663976
Type:
Small organic molecule
Emp. Form.:
C24H25FNO4
Mol. Mass.:
410.4586
SMILES:
CC(C)n1c(\C=C\[C@@H](O)C[C@@H](O)CC([O-])=O)c(-c2ccc(F)cc2)c2ccccc12
: