Target
Acetylcholinesterase
Ligand
BDBM50047737
Substrate
Meas. Tech.
ChEMBL_29096 (CHEMBL636834)
IC50
1500±n/a nM
Citation
 Sasho, SObase, HIchikawa, SKitazawa, TNonaka, HYoshizaki, RIshii, AShuto, K Synthesis of 2-imidazolidinylidenepropanedinitrile derivatives as stimulators of gastrointestinal motility. J Med Chem 36:572-9 (1993)  
Target
Name:
Acetylcholinesterase
Synonyms:
ACES_HUMAN Acetylcholinesterase (AChE) | Acetylcholinesterase (human AChE)
Type:
Enzyme
Mol. Mass.:
67792.70
Organism:
Homo sapiens (Human)
Description:
P22303
Residue:
614
  
Inhibitor
Name:
BDBM50047737
Synonyms:
2-(1-{2-[(5-Thiomorpholin-4-ylmethyl-furan-2-ylmethyl)-amino]-ethyl}-imidazolidin-2-ylidene)-malononitrile | CHEMBL157208
Type:
Small organic molecule
Emp. Form.:
C18H24N6OS
Mol. Mass.:
372.488
SMILES:
N#CC(C#N)C1=NCCN1CCNCc1ccc(CN2CCSCC2)o1
: