Target
Acetylcholinesterase
Ligand
BDBM50047751
Substrate
Meas. Tech.
ChEMBL_29096 (CHEMBL636834)
IC50
280±n/a nM
Citation
 Sasho, SObase, HIchikawa, SKitazawa, TNonaka, HYoshizaki, RIshii, AShuto, K Synthesis of 2-imidazolidinylidenepropanedinitrile derivatives as stimulators of gastrointestinal motility. J Med Chem 36:572-9 (1993)  
Target
Name:
Acetylcholinesterase
Synonyms:
ACES_HUMAN Acetylcholinesterase (AChE) | Acetylcholinesterase (human AChE)
Type:
Enzyme
Mol. Mass.:
67792.70
Organism:
Homo sapiens (Human)
Description:
P22303
Residue:
614
  
Inhibitor
Name:
BDBM50047751
Synonyms:
2-(Methylamino-{2-[(5-pyrrolidin-1-ylmethyl-furan-2-ylmethyl)-amino]-ethylamino}-methylene)-malononitrile | CHEMBL347539
Type:
Small organic molecule
Emp. Form.:
C17H24N6O
Mol. Mass.:
328.4121
SMILES:
CN=C(NCCNCc1ccc(CN2CCCC2)o1)C(C#N)C#N
: