Target
Sodium-dependent serotonin transporter
Ligand
BDBM50046732
Substrate
Meas. Tech.
ChEMBL_226363 (CHEMBL847531)
IC50
1.6±n/a nM
Citation
 Meltzer, PCLiang, AYBrownell, ALElmaleh, DRMadras, BK Substituted 3-phenyltropane analogs of cocaine: synthesis, inhibition of binding at cocaine recognition sites, and positron emission tomography imaging. J Med Chem 36:855-62 (1993)  
Target
Name:
Sodium-dependent serotonin transporter
Synonyms:
5-HT Transporter 5HTT SC6A4_HUMAN SLC6A4 Serotonin transporter (5HTT) Sodium-dependent serotonin transporter (SERT) | Solute carrier family 6 member 4
Type:
Multi-pass membrane protein
Mol. Mass.:
70322.51
Organism:
Homo sapiens (Human)
Description:
P31645
Residue:
630
  
Inhibitor
Name:
BDBM50046732
Synonyms:
(R)-3-(4-Chloro-phenyl)-8-aza-bicyclo[3.2.1]octane-2-carboxylic acid methyl ester 3-(4-Fluoro-phenyl)-8-methyl-8-aza-bicyclo[3.2.1]octane-2-carboxylic acid methyl ester | CHEMBL81525
Type:
Small organic molecule
Emp. Form.:
C15H18ClNO2
Mol. Mass.:
279.762
SMILES:
COC(=O)C1C2CCC(CC1c1ccc(Cl)cc1)N2
: