Target
5-hydroxytryptamine receptor 1B
Ligand
BDBM50453311
Substrate
Meas. Tech.
ChEMBL_1792 (CHEMBL616765)
Ki
7360±n/a nM
Citation
 Meyer, MDDeBernardis, JFHancock, AA Synthesis and structure activity relationships of cis- and trans-2,3,4,4a,9,9a-hexahydro-1H-indeno[2,1-c]pyridines for 5-HT receptor subtypes. J Med Chem 37:105-12 (1994)  
Target
Name:
5-hydroxytryptamine receptor 1B
Synonyms:
5-HT-1B 5-hydroxytryptamine receptor 1B (5HT1B) 5ht1b Serotonin 1 (5-HT1) receptor Serotonin receptor 1B
Type:
Protein
Mol. Mass.:
43173.33
Organism:
Rattus norvegicus (Rat)
Description:
P28564
Residue:
386
  
Inhibitor
Name:
BDBM50453311
Synonyms:
CHEMBL2079596
Type:
Small organic molecule
Emp. Form.:
C25H34N2O3
Mol. Mass.:
410.5491
SMILES:
[H][C@]12Cc3cccc(OC)c3[C@]1([H])CCN(CCCN1C(=O)CC3(CCCC3)CC1=O)C2
: