Target
5-hydroxytryptamine receptor 1A
Ligand
BDBM50453307
Substrate
Meas. Tech.
ChEMBL_1101 (CHEMBL616424)
Ki
76±n/a nM
Citation
 Meyer, MDDeBernardis, JFHancock, AA Synthesis and structure activity relationships of cis- and trans-2,3,4,4a,9,9a-hexahydro-1H-indeno[2,1-c]pyridines for 5-HT receptor subtypes. J Med Chem 37:105-12 (1994)  
Target
Name:
5-hydroxytryptamine receptor 1A
Synonyms:
5-HT-1A 5-HT1A 5-hydroxytryptamine receptor 1A (5HT1A) 5ht1a Htr1a Serotonin 1a (5-HT1a) receptor/Adrenergic receptor alpha-1 | Serotonin receptor 1A
Type:
G Protein-Coupled Receptor (GPCR)
Mol. Mass.:
46445.29
Organism:
Rattus norvegicus (rat)
Description:
Binding assays were performed using rat hippocampal membranes.
Residue:
422
  
Inhibitor
Name:
BDBM50453307
Synonyms:
CHEMBL2079544
Type:
Small organic molecule
Emp. Form.:
C16H23NO
Mol. Mass.:
245.3599
SMILES:
[H][C@]12Cc3cccc(OC)c3[C@]1([H])CCN(CCC)C2
: