Target
5-hydroxytryptamine receptor 1A
Ligand
BDBM50043661
Substrate
Meas. Tech.
ChEMBL_1101 (CHEMBL616424)
Ki
2±n/a nM
Citation
 Meyer, MDDeBernardis, JFHancock, AA Synthesis and structure activity relationships of cis- and trans-2,3,4,4a,9,9a-hexahydro-1H-indeno[2,1-c]pyridines for 5-HT receptor subtypes. J Med Chem 37:105-12 (1994)  
Target
Name:
5-hydroxytryptamine receptor 1A
Synonyms:
5-HT-1A 5-HT1A 5-hydroxytryptamine receptor 1A (5HT1A) 5ht1a Htr1a Serotonin 1a (5-HT1a) receptor/Adrenergic receptor alpha-1 | Serotonin receptor 1A
Type:
G Protein-Coupled Receptor (GPCR)
Mol. Mass.:
46445.29
Organism:
Rattus norvegicus (rat)
Description:
Binding assays were performed using rat hippocampal membranes.
Residue:
422
  
Inhibitor
Name:
BDBM50043661
Synonyms:
2-[4-(5-Methoxy-1,3,4,4a,9,9a-hexahydro-indeno[2,1-c]pyridin-2-yl)-butyl]-1,1-dioxo-1,2-dihydro-1lambda*6*-benzo[d]isothiazol-3-one | CHEMBL14010
Type:
Small organic molecule
Emp. Form.:
C24H28N2O4S
Mol. Mass.:
440.555
SMILES:
COc1cccc2CC3CN(CCCCN4C(=O)c5ccccc5S4(=O)=O)CCC3c12
: